{"text_format":"1","workbook":"xlsx","n_sheets":8,"sheets":["Dept","Division","Budget Transfer","BUDGET_DATA","FUND","ORGN","ACCT","CONFIG"],"not_rendered":{"charts":0,"images":1,"macros":1,"external_links":0,"defined_names":44,"comments":0,"pivot_tables":0},"unopened":[],"bounds":{"document_bytes":16777216,"sheet_cells":100000,"rows_first":2000,"rows_last":500,"rows_between":2000,"halvings":0,"cell_chars":16384,"cell_head_chars":4096},"cells_cut":0,"cells_raw":0,"read":"whole","date_system":"1900"}

{"sheet":"Dept","index":0,"n_rows":42,"n_cols":7,"rows_kept":42,"cut":false,"hidden":false,"merged":[[1,0,1,7],[21,0,21,3],[17,0,17,6],[24,1,25,7],[31,1,34,7],[29,0,29,3],[27,1,27,2],[7,1,7,4],[8,1,8,4],[9,1,9,4],[10,1,10,4],[19,1,19,2],[11,1,11,4],[13,2,13,4],[14,2,14,4],[15,1,15,4]]}
[]
["Budget Adjustment Increase Form"]
[]
[]
[]
[]
[]
["Name:"]
["Department:",""]
["Phone:",""]
["Email:"]
["Select Division:",""]
[]
["Fund:","",{"$f":"_xlfn.XLOOKUP(TEXT(FUND_PARAM,\"000000\"),LKUP_FUND,LKUP_FUND_DESC,\"**Description Not Found**\",0)","v":"**Description Not Found**"}]
["Orgn:","",{"$f":"_xlfn.XLOOKUP(TEXT(ORGN_PARAM,\"000000\"),LKUP_ORGN,LKUP_ORGN_DESC,\"**Description Not Found**\",0)","v":"**Description Not Found**"}]
["Select Account:",""]
[null,""]
[{"$f":"IF(OR(REQUESTED_AMOUNT>=THRESH_AMT,REQUESTED_PCT>=THRESH_PCT),\"PLEASE NOTE: THIS REQUEST WILL ALSO REQUIRE BUDGET OFFICE APPROVAL\",\"\")","v":""}]
[]
["Amount Requested?",0]
[]
["I will be collecting more revenue than originally budgeted:"]
["Please select Yes or No from the dropdown menu…"]
[]
["If yes, please explain:"]
[]
[]
["If yes, how much?",0,null,null,null,"If yes, revenue account:",""]
[null,null,null,null,null,"Example: 5xxxx"]
["Explanation of increase of budget:"]
[]
[]
[]
[]
[]
[]
[]
[]
[]
[]
[]
["Note: All highlighted form fields are required."]

{"sheet":"Division","index":1,"n_rows":39,"n_cols":5,"rows_kept":39,"cut":false,"hidden":false,"merged":[[1,0,1,4],[37,0,37,4],[13,0,13,4],[10,3,10,4],[11,3,11,4],[38,0,38,4],[15,0,15,4],[4,0,4,4],[5,0,5,4],[35,0,35,1],[16,0,16,4],[17,0,17,4],[18,0,21,4],[7,3,7,4],[8,3,8,4],[9,3,9,4]]}
[]
["Division Approval of Budget Adjustment"]
[]
[]
[]
[]
[]
["Name:",{"$f":"Dept!B8","v":0},"Fund:",{"$f":"IF(LEN(TRIM(FUND_PARAM))=0,\"\",FUND_PARAM & \": \" & FUND_PARAM_DESC)","v":""}]
["Dept:",{"$f":"IF(LEN(Dept!B9)=0,\"\",Dept!B9)","v":""},"Orgn:",{"$f":"IF(LEN(TRIM(ORGN_PARAM))=0,\"\",ORGN_PARAM & \": \" & ORGN_PARAM_DESC)","v":""}]
["Phone:",{"$f":"IF(LEN(Dept!B10)=0,\"\",Dept!B10)","v":""},"Acct:",{"$f":"ACCT_PARAM","v":""}]
["Email:",{"$f":"Dept!B11","v":0},"Req Budget:",{"$f":"REQUESTED_AMOUNT","v":0}]
["Division:",{"$f":"Dept!B12","v":""},"Revenue Adj:",{"$f":"REV_AMOUNT","v":0}]
[]
[{"$f":"IF(OR(REQUESTED_AMOUNT>=THRESH_AMT,REQUESTED_PCT>=THRESH_PCT),\"PLEASE NOTE: THIS REQUEST WILL ALSO REQUIRE BUDGET OFFICE APPROVAL\",\"\")","v":""}]
[]
["Please provide an explanation on why the original budget needs to be revised and why these changes"]
["were not included with the original All Funds Budget Request."]
[]
[{"$f":"IF(LEN(TRIM(EXPLANATION))=0,\"\",EXPLANATION)","v":""}]
[]
[]
[]
[]
["Account\nPool","Account Pool\nDescription",{"$f":" \"FY\" & RIGHT(PFY,2) & \" EOY\nActuals (Pd12)\"","v":"FY23 EOY\nActuals (Pd12)"},{"$f":"\"FY\" & RIGHT(CFY,2) & \" Orig/Adjst\nBudget\"","v":"FY24 Orig/Adjst\nBudget"},{"$f":"\"FY\" & RIGHT(CFY,2) & \" Req\nBudget Change\"","v":"FY24 Req\nBudget Change"}]
["5xxxx","Revenue1",{"$f":"SUMIF(ACCOUNT_POOL,\"5*\",PY_ACTUALS)-(IF(TRIM(REV_ACCT)=\"\",0,SUMIF(ACCOUNT_POOL,A26,PY_ACTUALS)))","v":0},{"$f":"SUMIF(ACCOUNT_POOL,\"5*\",CY_BUDGET)-(IF(TRIM(REV_ACCT)=\"\",0,SUMIF(ACCOUNT_POOL,A26,CY_BUDGET)))","v":0},{"$f":"IF(LEFT(ACCT_PARAM,1)=\"5\",REQUESTED_AMOUNT,0)","v":0}]
[{"$f":"IF(OR(LEN(TRIM(REV_ACCT))=0,TRIM(REV_ACCT)=\"\"),\"\",REV_ACCT)","v":""},{"$f":"IF(OR(LEN(TRIM(REV_ACCT))=0,TRIM(REV_ACCT)=\"\"),\"\",_xlfn.XLOOKUP(TEXT(REV_ACCT,\"00000\"),LKUP_ACCT,LKUP_ACCT_DESC,\"Description Unavailable\",0))","v":""},{"$f":"IF(TRIM(REV_ACCT)=\"\",\"\",SUMIF(ACCOUNT_POOL,A26,PY_ACTUALS))","v":""},{"$f":"IF(TRIM(REV_ACCT)=\"\",\"\",SUMIF(ACCOUNT_POOL,A26,CY_BUDGET))","v":""},{"$f":"IF(TRIM(REV_ACCT)=\"\",\"\",REV_AMOUNT*-1)","v":""}]
[60500,"Temp & Student Accounts Bdget",{"$f":"SUMIF(ACCOUNT_POOL,A27,PY_ACTUALS)","v":0},{"$f":"SUMIF(ACCOUNT_POOL,A27,CY_BUDGET)","v":0},{"$f":"IF(TEXT(LEFT(ACCT_PARAM,5),\"00000\")=TEXT(A27,\"00000\"),REQUESTED_AMOUNT,0)","v":0}]
[72000,"Supplies Budget Pool",0,0,0]
[72400,"Property Plant Equip Budget Pool",0,0,0]
[73000,"Purchased Contractual Svcs Pool",0,0,0]
[73200,"Travel Budget Pool",0,0,0]
[73400,"Current Services Pool",0,0,0]
[73600,"Other Fixed Charges Pool",0,0,0]
[73700,"Other Expenses & Adjustments",0,0,0]
[]
["Net (Gain) or Loss",null,{"$f":"SUM(C25:C35)","v":0},{"$f":"SUM(D25:D35)","v":0},{"$f":"SUM(E25:E35)","v":0}]
[]
["1Note: revenue amounts are shown as negative"]
["2Prior year actuals are based on period 12 results"]

{"sheet":"Budget Transfer","index":2,"n_rows":12,"n_cols":9,"rows_kept":12,"cut":false,"hidden":false,"merged":[[2,1,2,2],[4,1,4,2],[3,1,3,3],[5,1,5,2]]}
[]
[null,"Budget Transfer Entries for GURFEED"]
["Req By:",{"$f":"Dept!B8","v":0},null,null,null,"Total Revenue",{"$f":"SUMIF(D:D,\"5*\",H:H)","v":0}]
["Dept:",{"$f":"Dept!B9","v":""},null,null,null,"Total Expenditures",{"$f":"SUMIF(D:D,\"<>5*\",H:H)-SUMIF(D:D,\"8*\",H:H)","v":0}]
["Phone:",{"$f":"Dept!B10","v":""},null,null,null,"Total Transfer Out",{"$f":"SUMIF(D:D,\"8*\",H:H)","v":0}]
["Req Date:","2023-09-05",null,null,null,"Net Gain/(Loss)",{"$f":"G3-G4-G5","v":0}]
[null,null,null,null,null,"GURFEED Document Hash Total",{"$f":"SUM(H:H)","v":0}]
[null,null,null,null,null,null,{"$f":"COUNTA(B11:B1000)&\" Record(s) Generated\"","v":"2 Record(s) Generated"}]
[]
["RULE_CODE","FUND","ORGN","ACCT","PROG","ACTV","DESCRIPTION","AMOUNT","D/C"]
["BD04",{"$f":"TEXT(FUND_PARAM,\"000000\")","v":""},{"$f":"TEXT(ORGN_PARAM,\"000000\")","v":""},{"$f":"TEXT(REV_ACCT,\"00000\")","v":""},"0000",null,"Budget Adjst Rev Increase",{"$f":"REV_AMOUNT","v":0},"+"]
["BD04",{"$f":"TEXT(FUND_PARAM,\"000000\")","v":""},{"$f":"TEXT(ORGN_PARAM,\"000000\")","v":""},{"$f":"TEXT(LEFT(ACCT_PARAM,5),\"00000\")","v":""},"0000",null,"Budget Adjst Exp Increase",{"$f":"REQUESTED_AMOUNT","v":0},"+"]

{"sheet":"BUDGET_DATA","index":3,"n_rows":1,"n_cols":12,"rows_kept":1,"cut":false,"hidden":true,"merged":[]}
["FISCAL_YEAR","FISCAL_PERIOD","FUND","FUND_DESC","ORGANIZATION_CODE","ORGANIZATION_DESC","ACCOUNT_POOL","ACCOUNT_POOL_DESC","ACCOUNT","ACCOUNT_DESC","PY_YTD_ACTUALS","CY_ACCUM_BUDGET_YTD"]

{"sheet":"FUND","index":4,"n_rows":1344,"n_cols":2,"rows_kept":1344,"cut":false,"hidden":true,"merged":[]}
["FUND","FUND_DESC"]
["06065A","06065 ECUP Brody SOM Admin Depts"]
["06065C","06065 ECUP BSOM Clinical Depts"]
["06065D","06065 ECUP Division Level Depts"]
["06065E","06065 ECUP ECHI Institute"]
["06065M","06065 ECUP Non Oper Medicare"]
["06065N","06065 ECUP Non Oper Clearing"]
["06065O","DHS Other Schools"]
["06065P","SODM NonClinical Operations"]
["06065Q","SODM Administration"]
["06065R","SODM Departments"]
["06065S","Non Operating"]
["06065T","SODM Clinics"]
["06065U","SODM Faculty Practice Clinic"]
["06065W","SODM Community Practice"]
["06065X","SODM NonOperating"]
["06067A","06067 Overhead Receipts"]
["06067B","06067 Special ITF"]
["06067C","06067 Special ITF"]
["06067D","06067 Unrestricted Contracts"]
["06067F","06067 Restricted Scholarships"]
["06067G","06067 Restricted Professorships"]
["06067H","06067 Restricted Dept Use"]
["06067I","06067 Restricted Other"]
["06067K","06067 Auxiliary Funds"]
["06069A","Grants Budget Code-Fin Aid Restrict"]
["06069M","Grants Budget Code-Match"]
["06069P","Grants Budget Code-Rest Prog Income"]
["11","General Fund"]
["110","General Funds"]
["111001","Federal Witholding Disb 13"]
["111002","State Witholding Disb 13"]
["111101","AA Regular Term Instruction"]
["111102","AA Summer School Instruction"]
["111103","AA Non Credit and Receipt Supp Inst"]
["111104","AA Division Of Health Affairs"]
["111110","AA Organized Research"]
["111112","AA UNC System Lab Schools"]
["111142","AA Community Service"]
["111151","AA Libraries"]
["111152","AA Academic Support"]
["111155","COVID-19 Pandemic"]
["111157","American Rescue Plan Act"]
["111160","AA Student Support"]
["111170","AA General Institutional Support"]
["111180","AA Physical Plant Operations"]
["111230","AA Financial Aid"]
["111251","AA Salary Related Reserves"]
["111252","AA Other Reserves"]
["111990","AA Multiactivity"]
["111EEE","E-Payables Clearing Bk 13 16065"]
["111XXX","AA Payroll Dummy Fund"]
["112001","Federal  Witholding Disb 13 16066"]
["112002","State Witholding Disb 13 16066"]
["112101","HS Regular Term Instruction"]
["112104","HS DENTAL SCHOOL FUNDS"]
["112109","ARRA Fiscal Stabilization"]
["112110","HS Organized Research"]
["112115","COVID-19 Research BSOM"]
["112151","HS Libraries"]
["112155","COVID-19 Pandemic"]
["112170","HS General Institutional Support"]
["112230","HS Financial Aid"]
["112251","HS Salary Related Reserves"]
["112252","HS Other Reserves"]
["112990","HS Multiactivity"]
["112EEE","E-Payables Clearing Bk 13 16066"]
["112XXX","HS Payroll Dummy Fund"]
["119095","Payroll Clearing Fund"]
["12","Overhead Receipts"]
["120","Overhead Receipts"]
["120000","Inst Historical and Cultural Res OH"]
["120001","REDE Overhead Receipts"]
["120002","Computer Science Overhead"]
["120003","Engineering Overhead"]
["120004","Anthropology Overhead"]
["120005","Geography Overhead"]
["120006","English Overhead"]
["120007","Technology Overhead"]
["120008","Education Overhead"]
["120009","Dept of Coastal Studies Overhead"]
["120010","Tech Systems Overhead"]
["120011","College of Business Research"]
["120013","Social Work Overhead"]
["120014","AA F&A Overhead Receipt Fund"]
["120015","OETAS Overhead Receipts"]
["120016","Sociology Overhead"]
["120017","Economics Overhead"]
["120018","F&A Division of Student Affairs"]
["120020","Arts and Sciences Overhead"]
["120021","Biology Overhead"]
["120022","Chemistry Overhead"]
["120023","Geology Overhead"]
["120024","Physics Overhead"]
["120025","Psychology Overhead"]
["120026","Science Education Overhead"]
["120027","Construction Management Overhead"]
["120028","History Overhead"]
["120029","Math Department Overhead"]
["120031","CHHP/CHE Indirect Cost"]
["120032","HE PI Indirect Cost"]
["120033","Campus Operations Overhead Fund"]
["120034","Comparative Medicine"]
["120036","Integrated Coastal Program Overhead"]
["120037","Philosophy & RS Overhead"]
["120038","ECU Water Resources Center Overhead"]
["120039","Center for Natural Hazards Res F&A"]
["120040","COE Office of Research Overhead"]
["120041","Nursing Overhead"]
["120042","Allied Health Overhead"]
["120043","Research Facility Overhead"]
["120044","COE-REI Overhead"]
["120046","Laupus Library Overhead Receipts"]
["120049","Indirct Cost Recovery  Anatomy"]
["120050","BSOM Dean F&A"]
["120051","BSOM Academic Affairs F&A"]
["120052","StudentHealth Service Indirect Cost"]
["120053","Ledonia Wright Indirect Cost"]
["120056","SOM Administration"]
["120057","Allergy Res Lab"]
{"$rows_left_out":1225}
{"sheet":"ORGN","index":5,"n_rows":5567,"n_cols":2,"rows_kept":5567,"cut":false,"hidden":true,"merged":[]}
["ORGANIZATION_CODE","ORGANIZATION_DESC"]
["10","CH Chancellor"]
["101","CH Chancellor Office"]
["1011","CH Chancellor Office"]
["101101","CHH Chancellor Office"]
["101103","CH Chancellor Leadership Academy"]
["101104","CH ACE Fellow"]
["101105","CH Chancellor Search"]
["101106","CH COVID"]
["101107","CH COVID PPE"]
["1012","CH Chancellor Other"]
["101201","CH Chancellor Other"]
["102","CH Office of University Counsel"]
["1021","CH Office of University Counsel"]
["102101","CHH Office of University Counsel"]
["102102","CH Judgments"]
["102103","CH OUC Special"]
["103","CH Assistant to Chancellor Ops"]
["1031","CH Assistant to Chancellor Ops"]
["103101","CH Assistant to Chancellor Ops"]
["104","CH Office of Institutional Equity"]
["1041","CH INACTIVE Institutional Equity"]
["104101","AAH Office for Equity and Diversity"]
["104102","AA Inst Equity Related Programs"]
["104103","AA Equity Outreach and Recruitment"]
["104104","AA OED Reallocation"]
["104105","AA OED Comm on Status of Women"]
["104106","AA OED Orgn African Amer Staff"]
["105","CH Chief of Staff"]
["1051","CH Chief of Staff"]
["105101","CHH Chief of Staff"]
["105102","CH Ward Guest House"]
["105103","AAH REDE Community Engaged Research"]
["1052","CH Graduation"]
["105201","UFH Graduation"]
["1053","CH Special Events"]
["105302","CHH Special Events"]
["1054","CH Federal Relations"]
["106","CH Inst Planning Research Effective"]
["1061","CH INACTIVE Inst Plan Research Eff"]
["106101","AAH Inst PlanningAssessmentResearch"]
["106102","AA IPAR PWH Data PDAP"]
["106103","AA Inst Research"]
["106104","AA Campus Space Planning HR"]
["106105","AA English QEP"]
["106106","AA English QEP"]
["107","CH Internal Auditor"]
["1071","CH Internal Auditor"]
["107101","CHH Internal Auditor"]
["109","CH Faculty Senate"]
["1091","CH Faculty Senate"]
["109101","CHH Faculty Senate"]
["109102","CH Faculty Senate Delegate"]
["112","CH Public Srv and Community Relat"]
["1120","AA REDE Licensing and Commercial"]
["112001","AAH REDE Econ and Comm Engage Admin"]
["112002","AA CS Japan Center East"]
["112004","AA GCRT REDE 112004"]
["112005","AA REDE Shelton Leadership"]
["112006","AA REDE GCRT Menke"]
["112007","AA REDE GCRT ORNC Morris"]
["112008","AA REDE ORNC UNC SO Grant"]
["1121","CH Public Srv and Community Relat"]
["1122","AA REDE Small Bus and Tech Dev Cent"]
["112201","AAH REDE Small Bus and Tech Dev Ctr"]
["112202","AA REDE GCRT SBTDC"]
["1123","CH INACTIVE"]
["112301","AAH REDE Regional Development"]
["114","CH University Communications"]
["115","AA Chief Academic Success Officer"]
["1151","AA Chief Academic Success Officer"]
["11511","AA Enrollment Services"]
["115199","AA Chief Acad Success Univ Loan"]
["116","CH Athletic Office of Compliance"]
["1161","CH Athletic Office of Compliance"]
["116101","AA SACS"]
["116102","ATH Athletic Office of Compliance"]
["117","AF Public Safety"]
["118","AF Env Hlth Safety Aux Services"]
["20","AF Administration and Finance"]
["201","AF Enterprise Risk Mgmt"]
["2010","AF Enterprise Risk Mgmt"]
["202","AF Bdgt and Athltcs Fiscal Affairs"]
["2020","AF Bdgt and Athltcs Fiscal Affairs"]
["202101","AFH Bdgt and Athletics Admin"]
["206","AF ECU HLTH FIN MGMT AND RPTG"]
["21","AF Administration and Finance Admin"]
["2101","AF Administration and Finance Admin"]
["210101","AFH Administration and Finance Admn"]
["210103","AF Adm and Finance Reserves"]
["210104","UF General Institution Operations"]
["210105","UF Municipal Agreements"]
["210107","UF ETF Internship Liability Ins"]
["210108","UF Unexpected Events"]
["210109","UF Cares Act"]
["210110","AFH Asst VC for Admin and Finance"]
["210111","UF VC Student Affairs Search"]
["210113","AFH Enterprise Risk Management"]
["210114","AF VCAF Search"]
["210115","AF ERM Symposium"]
["210116","AF COVID"]
["210117","AF COVID PPE"]
["210118","AF COVID Testing"]
["210119","AF COVID HR"]
["210120","AF COVID IT"]
["210121","AF COVID Vaccine Tracking"]
["210190","UF Emergency Operations"]
["2102","AF Administration and Finance Other"]
["210201","AF VCAF Reallocation"]
["22","AF Human Resources"]
["2201","AF Human Resources"]
["220110","AFH Human Resources Admin"]
["220111","AF Staff Forum"]
["220112","AF Staff Senate Delegate"]
["220120","AFH Employment Services"]
["220130","AFH HR Information Systems"]
["220140","AFH Classification and Compensation"]
["220150","AFH Benefits"]
["220160","AFH Employee Relations"]
["220162","AFH Learning and Organizational Dev"]
{"$rows_left_out":5448}
{"sheet":"ACCT","index":6,"n_rows":1700,"n_cols":2,"rows_kept":1700,"cut":false,"hidden":true,"merged":[]}
["ACCOUNT","ACCOUNT_DESC"]
["5010","Tuition and Fees"]
["50101","Resident Undergrad Tuition"]
["50102","Resident Grad Tuition"]
["50103","Resident Undergrad Staff Waiver   "]
["50104","Resident Grad Staff Waiver"]
["50107","CF Unearned Resident Tuition"]
["5011","Tuition and Fees   Resident"]
["50111","Tuition Differentials"]
["50112","Resident Staff Waiver"]
["50113","Res Sen Citizen Tuition Waiver"]
["50114","Public Service Waiver"]
["50116","Resident Tuition Surcharge"]
["50117","Tuition Discount Tuition and Fees"]
["50118","Tuition Discount Sales and Services"]
["50119","Tuition & Fees - Bad Debt Offset"]
["5012","Tuition and Fees   Non Resident"]
["50120","Tuition/Fees-Recov Bad-debt WOffs"]
["50121","Non Resident Tuition"]
["50123","Non Resident Grad Asst Waiver"]
["50124","Non Resident Staff Waiver"]
["50126","Non Resident Tuition Surcharge"]
["50127","CF Unearned Nonresident Tuition"]
["50128","NonResident Veterans Tuition Waiver"]
["50129","Non Resident Undergrad Tuition"]
["50130","Non Resident Grad Tuition"]
["50131","Non Resident Undergrad Staff Waiver"]
["50132","Non Resident Grad Staff Waiver"]
["5014","Tuition and Fees   Other  Fees"]
["50140","Extension Instruction Fee"]
["50141","Unit Fee"]
["50142","Registration Fee - Extension Instr"]
["50143","Application Fee"]
["50147","Athletic Fee"]
["50148","Health Service Fee"]
["50149","Activity Fee"]
["50150","Future Orientation"]
["50151","Indebtedness Fee      "]
["50152","Educ and Tech Fee"]
["50153","Special Fee"]
["50154","Graduation Fee"]
["50155","Withdrawal Processing Fees"]
["50156","Transcripts"]
["50157","Enrollment"]
["50159","Audit Fees In State"]
["50160","Audit Fees Out of State"]
["50161","Credit by Exam"]
["50162","Student Health Insur Waiver Fee"]
["50163","Installment Payment Plan Fee"]
["50164","Enrollment & Degree VerificationFee"]
["50165","Immunization Fee"]
["50166","Transit Fee"]
["50167","Campus Security Fee"]
["50189","Enrollment Increase Reserves"]
["5020","Patient Services Net"]
["50201","Patient Charges"]
["50203","Patient Contractual Adjustments"]
["50205","Patient Other Adjustments"]
["50207","Patient Bad Debt Writeoffs"]
["50209","Patient Reserve for Adjustments"]
["5021","Patient Services Net"]
["50210","Patient Charges Nontaxable"]
["50211","Patient Reserve for Bad Debt"]
["50212","Patient Chrg Indigent Care NonTax"]
["50213","Medicare Stimulus CV19"]
["50214","CARES Act CV19"]
["50215","SODM Stimulus CV19 PC"]
["50216","SODM Stimulus CV19 NO"]
["50240","Med Contract Taxable Pool"]
["50241","Med Contract State Govt"]
["50242","Med Contract Fed Govt"]
["50243","Med Contract County Govt"]
["50244","Med Contract Private"]
["50245","Med Contract Rev Non-Taxable Pool"]
["50246","Med Contract Interdepartmental"]
["50247","Med Contract Revenue UHS"]
["50248","Med Contract UHS Non-Taxable"]
["50249","Med Contract Clearing"]
["50250","Med Contract Med Records State"]
["50251","Med Contract Med Records Federal"]
["50252","Med Contract Med Records Private"]
["50253","Med Contract MRI Receipts"]
["50254","Med Contract Transplant Rcpts"]
["50255","Med Contract NonTaxable"]
["50271","Med Pharmacy Chemo"]
["50273","Med Pharmacy Retail"]
["50275","Med Pharmacy Clinic"]
["50276","Med Pharmacy MTM"]
["50277","Med Pharmacy Precepting"]
["50281","Dental Clinic"]
["50285","GME Reimbursement"]
["50286","Medicaid Managed Care"]
["50287","Medicaid Cost Settlement"]
["50291","Misc NonTaxable Revenue DHS"]
["50293","Misc Revenue DHS"]
["50295","Ryan White Support Revenue"]
["5030","Federal Appropriations"]
["5031","CG   Federal Appropriations"]
["5040","Federal Grants and Contracts"]
["50405","Federal Grants Student FinancialAid"]
["50406","Federal Grant Financial Aid Other"]
["50408","Financial Aid Carry Forward"]
["50409","Financial Aid Carry Back"]
["5041","Federal Grants and Contracts"]
["50410","Federal Interest Subsidy on Debt"]
["50411","Federal Grant and Contract Revenue"]
["50412","Grant and Contract F&A Distribution"]
["50413","Fed Fin Aid Admin Cost Allowance"]
["50414","Federal Aid-COVID 19-HEERF Student"]
["50415","Federal Aid-COVID 19-HEERF Insti"]
["50416","COVID-19 FEMA Grant"]
["50417","Federal Grants-COVID"]
["5050","StateLocal Grants and Contracts"]
["50505","State Grants Student Financial Aid"]
["5051","State and Local Grants"]
["50512","State Grant and Contract Revenue"]
["50513","State Grants and Contracts OH Rec"]
["50520","State Aid - Coronavirus"]
["50530","State Aid-Retiree Supplement Reserv"]
["50541","County Grant and Contract Revenue"]
{"$rows_left_out":1581}
{"sheet":"CONFIG","index":7,"n_rows":40,"n_cols":14,"rows_kept":40,"cut":false,"hidden":true,"merged":[[2,6,2,8],[17,6,17,8],[2,11,2,13]]}
[null,null,"Configuration Settings"]
[]
[null,null,"TIME LOGIC",null,null,null,"THRESHOLD LOGIC",null,null,null,null,"POOL ACCOUNTS DROPDOWN SELECTION"]
[null,null,null,null,null,null,null,null,null,null,null,"Code","Description","List Description"]
[null,null,null,null,null,null,null,null,null,null,null,"60500","Temp & Student Accounts Bdget",{"$f":"_xlfn.CONCAT(L5,\": \",_xlfn.XLOOKUP(TEXT(L5,\"00000\"),LKUP_ACCT,LKUP_ACCT_DESC,\"Description Not Found\",0))","v":"60500: Temp and Student Accounts Budget Po"}]
[null,null,"Current Calendar Year:",{"$f":"YEAR(TODAY())","v":2023},null,null,"Requested Amount:",{"$f":"REQUESTED_AMOUNT","v":0},null,null,null,"72000","Supplies Budget Pool","72000: Supplies Budget Pool"]
[null,null,"Current Calendar Month:",{"$f":"MONTH(TODAY())","v":9},null,null,"Current Budget:",{"$f":"ROUND(SUMIF(ACCOUNT,LEFT(ACCT_PARAM,5),CY_BUDGET),2)","v":0},null,null,null,"72400","Property Plant Equip Budget Pool","72400: Property Plant Equip Budget Pool"]
[null,null,null,null,null,null,null,null,null,null,null,"73000","Purchased Contractual Svcs Pool","73000: Purchased Contractual Svcs Pool"]
[null,null,null,null,null,null,"Percentage:",{"$f":"IF(H7=0,0,H6/H7)","v":0},null,null,null,"73200","Travel Budget Pool","73200: Travel Budget Pool"]
[null,null,null,null,null,null,null,null,null,null,null,"73400","Current Services Pool","73400: Current Services Pool"]
[null,null,null,null,null,null,null,null,null,null,null,"73600","Other Fixed Charges Pool","73600: Other Fixed Charges Pool"]
[null,null,"Current Fiscal Year:",{"$f":"IF(CURR_MONTH>=7,TEXT(CURR_CAL_YEAR+1,\"0000\"),TEXT(CURR_CAL_YEAR,\"0000\"))","v":"2024"},null,null,"Threshold (%)",0.1,null,null,null,"73700","Other Expenses & Adjustments","73700: Other Expenses and Adjustments"]
[null,null,"Prior Fiscal Year: ",{"$f":"TEXT(D12-1,\"0000\")","v":"2023"},null,null,"Threshold ($)",10000,"Is this needed?"]
[]
[null,null,"Current Fiscal Period:",{"$f":"IF(CURR_MONTH>=7,TEXT(CURR_MONTH-6,\"00\"),TEXT(CURR_MONTH,\"00\"))","v":"03"},null,null,"Division Approval?",{"$f":"IF(OR(REQUESTED_AMOUNT>=THRESH_AMT,REQUESTED_PCT>=THRESH_PCT),\"YES\",\"NO\")","v":"NO"}]
[]
[]
[null,null,null,null,null,null,"LIST OF APPROVERS (PIRATE ID)"]
[]
[null,null,"QUERY PARAMETERS",null,null,null,"Division","Division Approver"]
[null,null,null,null,null,null,"10: CH Chancellor","sandefordw@ecu.edu"]
[null,null,null,null,null,null,"20: AF Administration and Finance","sandefordw@ecu.edu"]
[null,null,"CURRENT_FISCAL_YEAR",null,null,null,"40: SA Student Affairs","matternb@ecu.edu"]
[null,null,{"$f":"D12","v":"2024"},null,null,null,"50: AA Academic Affairs","leer@ecu.edu"]
[null,null,null,null,null,null,"60: EH ECU Health","richardsp@ecu.edu"]
[null,null,null,null,null,null,"80: AT Athletics","[To be determined…]"]
[null,null,"PRIOR_FISCAL_YEAR"]
[null,null,{"$f":"D13","v":"2023"}]
[]
[]
[null,null,"CURRENT_FISCAL_PERIOD"]
[null,null,{"$f":"D15","v":"03"},null,null,null,"Selected Division Approver:",{"$f":"_xlfn.XLOOKUP(DIVISION_PARAM,DIVISION_LIST,DIVISION_APPROVER,\"\",0)","v":""}]
[]
[null,null,null,null,null,null,"Budget Office Approver(s):","budgetofficeitf@ecu.edu"]
[null,null,"FUND"]
[null,null,{"$f":"TEXT(FUND_PARAM,\"000000\")","v":""}]
[]
[]
[null,null,"ORGN"]
[null,null,{"$f":"TEXT(ORGN_PARAM,\"000000\")","v":""}]